Reaction Details
TargetCasein kinase I isoform delta
LigandBDBM50390497
Substrate/Competitorn/a
Meas. Tech.ChEMBL_835302 (CHEMBL2072008)
IC50 1080±n/a nM
Citation Hua, ZHuang, XBregman, HChakka, NDiMauro, EFDoherty, EMGoldstein, JGunaydin, HHuang, HMercede, SNewcomb, JPatel, VFTurci, SMYan, JWilson, CMartin, MW 2-Phenylamino-6-cyano-1H-benzimidazole-based isoform selective casein kinase 1 gamma (CK1¿) inhibitors. Bioorg Med Chem Lett22:5392-5 (2012) 
 
Casein kinase I isoform delta
Name:Casein kinase I isoform delta
Type:Enzyme
Mol. Mass.:47356.76
Organism:Homo sapiens (Human)
Description:P48730
Residue:415
BDBM50390497
NameBDBM50390497
Synonyms:CHEMBL2071611
TypeSmall organic molecule
Emp. Form.C18H14N6
Mol. Mass.314.344
SMILESCn1cc(cn1)-c1ccc(Nc2nc3ccc(cc3[nH]2)C#N)cc1