Reaction Details
TargetCasein kinase I isoform delta
LigandBDBM50390498
Substrate/Competitorn/a
Meas. Tech.ChEMBL_835302 (CHEMBL2072008)
IC50 2620±n/a nM
Citation Hua, ZHuang, XBregman, HChakka, NDiMauro, EFDoherty, EMGoldstein, JGunaydin, HHuang, HMercede, SNewcomb, JPatel, VFTurci, SMYan, JWilson, CMartin, MW 2-Phenylamino-6-cyano-1H-benzimidazole-based isoform selective casein kinase 1 gamma (CK1¿) inhibitors. Bioorg Med Chem Lett22:5392-5 (2012) 
 
Casein kinase I isoform delta
Name:Casein kinase I isoform delta
Type:Enzyme
Mol. Mass.:47356.76
Organism:Homo sapiens (Human)
Description:P48730
Residue:415
BDBM50390498
NameBDBM50390498
Synonyms:CHEMBL2071612
TypeSmall organic molecule
Emp. Form.C18H18N4
Mol. Mass.290.3623
SMILESCC(C)(C)c1ccc(Nc2nc3ccc(cc3[nH]2)C#N)cc1