Reaction Details
TargetCasein kinase I isoform gamma-2
LigandBDBM124350
Substrate/Competitorn/a
Meas. Tech.ChEMBL_835304 (CHEMBL2072010)
IC50 6560±n/a nM
Citation Hua, ZHuang, XBregman, HChakka, NDiMauro, EFDoherty, EMGoldstein, JGunaydin, HHuang, HMercede, SNewcomb, JPatel, VFTurci, SMYan, JWilson, CMartin, MW 2-Phenylamino-6-cyano-1H-benzimidazole-based isoform selective casein kinase 1 gamma (CK1¿) inhibitors. Bioorg Med Chem Lett22:5392-5 (2012) 
 
Casein kinase I isoform gamma-2
Name:Casein kinase I isoform gamma-2
Type:PROTEIN
Mol. Mass.:47475.36
Organism:Homo sapiens (Human)
Description:ChEMBL_774313
Residue:415
BDBM124350
NameBDBM124350
Synonyms:CHEMBL2071607 | US8759532, 1
TypeSmall organic molecule
Emp. Form.C20H12F3N5O
Mol. Mass.395.3374
SMILESFC(F)(F)c1cccnc1Oc1ccc(Nc2nc3ccc(cc3[nH]2)C#N)cc1