Reaction Details
TargetCasein kinase I isoform gamma-2
LigandBDBM50390496
Substrate/Competitorn/a
Meas. Tech.ChEMBL_835304 (CHEMBL2072010)
IC50 1170±n/a nM
Citation Hua, ZHuang, XBregman, HChakka, NDiMauro, EFDoherty, EMGoldstein, JGunaydin, HHuang, HMercede, SNewcomb, JPatel, VFTurci, SMYan, JWilson, CMartin, MW 2-Phenylamino-6-cyano-1H-benzimidazole-based isoform selective casein kinase 1 gamma (CK1¿) inhibitors. Bioorg Med Chem Lett22:5392-5 (2012) 
 
Casein kinase I isoform gamma-2
Name:Casein kinase I isoform gamma-2
Type:PROTEIN
Mol. Mass.:47475.36
Organism:Homo sapiens (Human)
Description:ChEMBL_774313
Residue:415
BDBM50390496
NameBDBM50390496
Synonyms:CHEMBL2071610
TypeSmall organic molecule
Emp. Form.C19H12FN5
Mol. Mass.329.3305
SMILESFc1ncccc1-c1ccc(Nc2nc3ccc(cc3[nH]2)C#N)cc1