Reaction Details
TargetCarbonic anhydrase 12
LigandBDBM50184624
Substrate/Competitorn/a
Meas. Tech.ChEMBL_835657 (CHEMBL2071768)
Ki 770±n/a nM
Citation Sechi, MInnocenti, APala, NRogolino, DCarcelli, MScozzafava, ASupuran, CT Inhibition ofa-class cytosolic human carbonic anhydrases I, II, IX and XII, andß-class fungal enzymes by carboxylic acids and their derivatives: new isoform-I selective nanomolar inhibitors. Bioorg Med Chem Lett22:5801-6 (2012) 
 
Carbonic anhydrase 12
Name:Carbonic anhydrase 12
Type:Enzyme
Mol. Mass.:39456.00
Organism:Homo sapiens (Human)
Description:Catalytic domain of human cloned isozyme was used in the assay
Residue:354
BDBM50184624
NameBDBM50184624
Synonyms:6-(2-methoxyphenyl)-2,4,6-trioxohexanoic acid CHEMBL208806
TypeSmall organic molecule
Emp. Form.C13H12O6
Mol. Mass.264.2308
SMILESCOc1ccccc1C(=O)CC(=O)CC(=O)C(O)=O