Reaction Details
TargetCarbonic anhydrase 12
LigandBDBM50390681
Substrate/Competitorn/a
Meas. Tech.ChEMBL_835657 (CHEMBL2071768)
Ki 7780±n/a nM
Citation Sechi, MInnocenti, APala, NRogolino, DCarcelli, MScozzafava, ASupuran, CT Inhibition ofa-class cytosolic human carbonic anhydrases I, II, IX and XII, andß-class fungal enzymes by carboxylic acids and their derivatives: new isoform-I selective nanomolar inhibitors. Bioorg Med Chem Lett22:5801-6 (2012) 
 
Carbonic anhydrase 12
Name:Carbonic anhydrase 12
Type:Enzyme
Mol. Mass.:39456.00
Organism:Homo sapiens (Human)
Description:Catalytic domain of human cloned isozyme was used in the assay
Residue:354
BDBM50390681
NameBDBM50390681
Synonyms:CHEMBL2070207
TypeSmall organic molecule
Emp. Form.C14H13N3O2
Mol. Mass.255.2719
SMILESCCn1cc(-c2cc([nH]n2)C(O)=O)c2ccccc12