Reaction Details
TargetCarbonic anhydrase 1
LigandBDBM50390677
Substrate/Competitorn/a
Meas. Tech.ChEMBL_835654 (CHEMBL2071765)
Ki 4410±n/a nM
Citation Sechi, MInnocenti, APala, NRogolino, DCarcelli, MScozzafava, ASupuran, CT Inhibition ofa-class cytosolic human carbonic anhydrases I, II, IX and XII, andß-class fungal enzymes by carboxylic acids and their derivatives: new isoform-I selective nanomolar inhibitors. Bioorg Med Chem Lett22:5801-6 (2012) 
 
Carbonic anhydrase 1
Name:Carbonic anhydrase 1
Type:Enzyme
Mol. Mass.:28873.37
Organism:Homo sapiens (Human)
Description:P00915
Residue:261
BDBM50390677
NameBDBM50390677
Synonyms:CHEMBL41028
TypeSmall organic molecule
Emp. Form.C4H4O6
Mol. Mass.148.071
SMILESOC(C(O)=O)C(=O)C(O)=O