Reaction Details
TargetCarbonic anhydrase 2
LigandBDBM50115579
Substrate/Competitorn/a
Meas. Tech.ChEMBL_835655 (CHEMBL2071766)
Ki 4300±n/a nM
Citation Sechi, MInnocenti, APala, NRogolino, DCarcelli, MScozzafava, ASupuran, CT Inhibition ofa-class cytosolic human carbonic anhydrases I, II, IX and XII, andß-class fungal enzymes by carboxylic acids and their derivatives: new isoform-I selective nanomolar inhibitors. Bioorg Med Chem Lett22:5801-6 (2012) 
 
Carbonic anhydrase 2
Name:Carbonic anhydrase 2
Type:Enzyme
Mol. Mass.:29250.71
Organism:Homo sapiens (Human)
Description:P00918
Residue:260
BDBM50115579
NameBDBM50115579
Synonyms:(Z)-2-hydroxy-4-oxo-4-phenyl-but-2-enoic acid 2-Hydroxy-4-oxo-4-phenyl-but-2-enoic acid (0.25H2O) CHEMBL19332 Sacchettini_CTRL
TypeSmall organic molecule
Emp. Form.C10H8O4
Mol. Mass.192.1681
SMILESOC(=O)C(=O)CC(=O)c1ccccc1