Reaction Details
TargetLIM domain kinase 1
LigandBDBM50390781
Substrate/Competitorn/a
Meas. Tech.ChEMBL_835728 (CHEMBL2071839)
IC50 250±n/a nM
Citation He, LSeitz, SPTrainor, GLTortolani, DVaccaro, WPoss, MTarby, CMTokarski, JSPenhallow, BHung, CYAttar, RLin, TA Modulation of cofilin phosphorylation by inhibition of the Lim family kinases. Bioorg Med Chem Lett22:5995-8 (2012) 
 
LIM domain kinase 1
Name:LIM domain kinase 1
Type:Enzyme Catalytic Domain
Mol. Mass.:72591.81
Organism:Homo sapiens (Human)
Description:gi_4505001
Residue:647
BDBM50390781
NameBDBM50390781
Synonyms:CHEMBL2070499
TypeSmall organic molecule
Emp. Form.C25H24Cl2N6OS
Mol. Mass.527.469
SMILESCCCNc1ncc(s1)-c1cc(nc(n1)-c1cnccn1)-c1c(Cl)cc(OC2CCCC2)cc1Cl