Reaction Details
TargetLIM domain kinase 1
LigandBDBM50390789
Substrate/Competitorn/a
Meas. Tech.ChEMBL_835728 (CHEMBL2071839)
IC50 66±n/a nM
Citation He, LSeitz, SPTrainor, GLTortolani, DVaccaro, WPoss, MTarby, CMTokarski, JSPenhallow, BHung, CYAttar, RLin, TA Modulation of cofilin phosphorylation by inhibition of the Lim family kinases. Bioorg Med Chem Lett22:5995-8 (2012) 
 
LIM domain kinase 1
Name:LIM domain kinase 1
Type:Enzyme Catalytic Domain
Mol. Mass.:72591.81
Organism:Homo sapiens (Human)
Description:gi_4505001
Residue:647
BDBM50390789
NameBDBM50390789
Synonyms:CHEMBL2070613
TypeSmall organic molecule
Emp. Form.C26H29N7O2S
Mol. Mass.503.619
SMILESCCC(CC)Oc1cc(C)c(c(C)c1)-c1cc(nc(n1)-c1cnccn1)-c1cnc(NC(=O)NC)s1