Reaction Details
TargetMitogen-activated protein kinase 14
LigandBDBM50327390
Substrate/Competitorn/a
Meas. Tech.ChEMBL_835729 (CHEMBL2071840)
IC50 4±n/a nM
Citation He, LSeitz, SPTrainor, GLTortolani, DVaccaro, WPoss, MTarby, CMTokarski, JSPenhallow, BHung, CYAttar, RLin, TA Modulation of cofilin phosphorylation by inhibition of the Lim family kinases. Bioorg Med Chem Lett22:5995-8 (2012) 
 
Mitogen-activated protein kinase 14
Name:Mitogen-activated protein kinase 14
Type:Serine/threonine-protein kinase
Mol. Mass.:41286.76
Organism:Homo sapiens (Human)
Description:Q16539
Residue:360
BDBM50327390
NameBDBM50327390
Synonyms:5-(6-(2-chlorophenyl)-2-(pyridin-2-yl)pyrimidin-4-yl)-N-isopropylthiazol-2-amine | CHEMBL1258633
TypeSmall organic molecule
Emp. Form.C21H18ClN5S
Mol. Mass.407.919
SMILESCC(C)Nc1ncc(s1)-c1cc(nc(n1)-c1ccccn1)-c1ccccc1Cl