Reaction Details
TargetLIM domain kinase 2
LigandBDBM50390775
Substrate/Competitorn/a
Meas. Tech.ChEMBL_835730 (CHEMBL2071841)
IC50 1232±n/a nM
Citation He, LSeitz, SPTrainor, GLTortolani, DVaccaro, WPoss, MTarby, CMTokarski, JSPenhallow, BHung, CYAttar, RLin, TA Modulation of cofilin phosphorylation by inhibition of the Lim family kinases. Bioorg Med Chem Lett22:5995-8 (2012) 
 
LIM domain kinase 2
Name:LIM domain kinase 2
Type:PROTEIN
Mol. Mass.:72238.81
Organism:Homo sapiens (Human)
Description:ChEMBL_1514398
Residue:638
BDBM50390775
NameBDBM50390775
Synonyms:CHEMBL2070493
TypeSmall organic molecule
Emp. Form.C21H19ClN6OS
Mol. Mass.438.933
SMILESCCCNc1ncc(s1)-c1cc(nc(n1)-c1cnccn1)-c1ccc(OC)cc1Cl