Reaction Details
TargetDual specificity testis-specific protein kinase 1
LigandBDBM50390784
Substrate/Competitorn/a
Meas. Tech.ChEMBL_835731 (CHEMBL2071842)
IC50>30000±n/a nM
Citation He, LSeitz, SPTrainor, GLTortolani, DVaccaro, WPoss, MTarby, CMTokarski, JSPenhallow, BHung, CYAttar, RLin, TA Modulation of cofilin phosphorylation by inhibition of the Lim family kinases. Bioorg Med Chem Lett22:5995-8 (2012) 
 
Dual specificity testis-specific protein kinase 1
Name:Dual specificity testis-specific protein kinase 1
Type:PROTEIN
Mol. Mass.:67696.22
Organism:Homo sapiens (Human)
Description:ChEMBL_587103
Residue:626
BDBM50390784
NameBDBM50390784
Synonyms:CHEMBL2070503
TypeSmall organic molecule
Emp. Form.C23H23ClN6OS
Mol. Mass.466.986
SMILESCCCNc1ncc(s1)-c1cc(nc(n1)-c1cnccn1)-c1cc(OCCC)ccc1Cl