Reaction Details
TargetDual specificity testis-specific protein kinase 1
LigandBDBM50390792
Substrate/Competitorn/a
Meas. Tech.ChEMBL_835731 (CHEMBL2071842)
IC50 2265±n/a nM
Citation He, LSeitz, SPTrainor, GLTortolani, DVaccaro, WPoss, MTarby, CMTokarski, JSPenhallow, BHung, CYAttar, RLin, TA Modulation of cofilin phosphorylation by inhibition of the Lim family kinases. Bioorg Med Chem Lett22:5995-8 (2012) 
 
Dual specificity testis-specific protein kinase 1
Name:Dual specificity testis-specific protein kinase 1
Type:PROTEIN
Mol. Mass.:67696.22
Organism:Homo sapiens (Human)
Description:ChEMBL_587103
Residue:626
BDBM50390792
NameBDBM50390792
Synonyms:CHEMBL2070616
TypeSmall organic molecule
Emp. Form.C22H20N6O2S
Mol. Mass.432.498
SMILESCOc1cc(C)c(c(C)c1)-c1cc(nc(n1)-c1cnccn1)-c1cnc(NC(C)=O)s1