Reaction Details
TargetDual specificity testis-specific protein kinase 1
LigandBDBM50390790
Substrate/Competitorn/a
Meas. Tech.ChEMBL_835731 (CHEMBL2071842)
IC50 1133±n/a nM
Citation He, LSeitz, SPTrainor, GLTortolani, DVaccaro, WPoss, MTarby, CMTokarski, JSPenhallow, BHung, CYAttar, RLin, TA Modulation of cofilin phosphorylation by inhibition of the Lim family kinases. Bioorg Med Chem Lett22:5995-8 (2012) 
 
Dual specificity testis-specific protein kinase 1
Name:Dual specificity testis-specific protein kinase 1
Type:PROTEIN
Mol. Mass.:67696.22
Organism:Homo sapiens (Human)
Description:ChEMBL_587103
Residue:626
BDBM50390790
NameBDBM50390790
Synonyms:CHEMBL2070614
TypeSmall organic molecule
Emp. Form.C22H21N7O2S
Mol. Mass.447.513
SMILESCNC(=O)Nc1ncc(s1)-c1cc(nc(n1)-c1cnccn1)-c1c(C)cc(OC)cc1C