Reaction Details
TargetcAMP and cAMP-inhibited cGMP 3',5'-cyclic phosphodiesterase 10A
LigandBDBM50390812
Substrate/Competitorn/a
Meas. Tech.ChEMBL_835769 (CHEMBL2071880)
IC50 0.28±n/a nM
Citation Malamas, MSStange, HSchindler, RLankau, HJGrunwald, CLangen, BEgerland, UHage, TNi, YErdei, JFan, KYParris, KMarquis, KLGrauer, SBrennan, JNavarra, RGraf, RHarrison, BLRobichaud, AKronbach, TPangalos, MNBrandon, NJHoefgen, N Novel triazines as potent and selective phosphodiesterase 10A inhibitors. Bioorg Med Chem Lett22:5876-84 (2012) 
 
cAMP and cAMP-inhibited cGMP 3',5'-cyclic phosphodiesterase 10A
Name:cAMP and cAMP-inhibited cGMP 3',5'-cyclic phosphodiesterase 10A
Type:Protein
Mol. Mass.:88412.52
Organism:Homo sapiens (Human)
Description:Q9Y233
Residue:779
BDBM50390812
NameBDBM50390812
Synonyms:CHEMBL2069321
TypeSmall organic molecule
Emp. Form.C18H15ClN4O2
Mol. Mass.354.79
SMILESCOc1cc(OC)c2nnc3c(C)nc(-c4ccccc4Cl)n3c2c1