Reaction Details
TargetcAMP and cAMP-inhibited cGMP 3',5'-cyclic phosphodiesterase 10A
LigandBDBM50390818
Substrate/Competitorn/a
Meas. Tech.ChEMBL_835769 (CHEMBL2071880)
IC50 0.85±n/a nM
Citation Malamas, MSStange, HSchindler, RLankau, HJGrunwald, CLangen, BEgerland, UHage, TNi, YErdei, JFan, KYParris, KMarquis, KLGrauer, SBrennan, JNavarra, RGraf, RHarrison, BLRobichaud, AKronbach, TPangalos, MNBrandon, NJHoefgen, N Novel triazines as potent and selective phosphodiesterase 10A inhibitors. Bioorg Med Chem Lett22:5876-84 (2012) 
 
cAMP and cAMP-inhibited cGMP 3',5'-cyclic phosphodiesterase 10A
Name:cAMP and cAMP-inhibited cGMP 3',5'-cyclic phosphodiesterase 10A
Type:Protein
Mol. Mass.:88412.52
Organism:Homo sapiens (Human)
Description:Q9Y233
Residue:779
BDBM50390818
NameBDBM50390818
Synonyms:CHEMBL2070655
TypeSmall organic molecule
Emp. Form.C21H20ClN5O2
Mol. Mass.409.869
SMILESCOc1cc(cc2c1nnc1c(C)nc(-c3ccccc3Cl)n21)N1CCOCC1