Reaction Details
TargetTranslocator protein
LigandBDBM50390840
Substrate/Competitorn/a
Meas. Tech.ChEMBL_835804 (CHEMBL2071915)
Ki 0.19±n/a nM
Citation Wadsworth, HJones, PAChau, WFDurrant, CMorisson-Iveson, VPassmore, JO'Shea, DWynn, DKhan, IBlack, AAvory, MTrigg, W Exploration of the structure-activity relationship of the diaryl anilide class of ligands for translocator protein--potential novel positron emitting tomography imaging agents. Bioorg Med Chem Lett22:5795-800 (2012) 
 
Translocator protein
Name:Translocator protein
Type:Mitochondrion membrane protein
Mol. Mass.:18945.84
Organism:Rattus norvegicus (rat)
Description:Competitive binding experiments were performed on rat kidney mitochondrial membranes.
Residue:169
BDBM50390840
NameBDBM50390840
Synonyms:CHEMBL2070786
TypeSmall organic molecule
Emp. Form.C24H23F2NO4
Mol. Mass.427.4405
SMILESCOc1ccc(OCCF)cc1CN(C(C)=O)c1cc(F)ccc1Oc1ccccc1