Reaction Details
TargetPotassium voltage-gated channel subfamily H member 2
LigandBDBM50390916
Substrate/Competitorn/a
Meas. Tech.ChEMBL_835833 (CHEMBL2071944)
IC50>30000±n/a nM
Citation Mattmann, MEYu, HLin, ZXu, KHuang, XLong, SWu, MMcManus, OBEngers, DWLe, UMLi, MLindsley, CWHopkins, CR Identification of (R)-N-(4-(4-methoxyphenyl)thiazol-2-yl)-1-tosylpiperidine-2-carboxamide, ML277, as a novel, potent and selective K(v)7.1 (KCNQ1) potassium channel activator. Bioorg Med Chem Lett22:5936-41 (2012) 
 
Potassium voltage-gated channel subfamily H member 2
Name:Potassium voltage-gated channel subfamily H member 2
Type:Multi-pass membrane protein
Mol. Mass.:126672.65
Organism:Homo sapiens (Human)
Description:Q12809
Residue:1159
BDBM50390916
NameBDBM50390916
Synonyms:CHEMBL2070953
TypeSmall organic molecule
Emp. Form.C23H25N3O4S2
Mol. Mass.471.592
SMILESCOc1ccc(cc1)-c1csc(NC(=O)[C@H]2CCCCN2S(=O)(=O)c2ccc(C)cc2)n1