Reaction Details
TargetLysine-specific demethylase 4C
LigandBDBM26113
Substrate/Competitorn/a
Meas. Tech.ChEMBL_835849 (CHEMBL2071960)
IC50 2400±n/a nM
Citation Leurs, UClausen, RPKristensen, JLLohse, B Inhibitor scaffold for the histone lysine demethylase KDM4C (JMJD2C). Bioorg Med Chem Lett22:5811-3 (2012) 
 
Lysine-specific demethylase 4C
Name:Lysine-specific demethylase 4C
Type:Protein
Mol. Mass.:119979.01
Organism:Homo sapiens (Human)
Description:Q9H3R0
Residue:1056
BDBM26113
NameBDBM26113
Synonyms:2,4 PDCA pyridine carboxylate, 6a | pyridine-2,4-dicarboxylic acid
TypeSmall organic molecule
Emp. Form.C7H5NO4
Mol. Mass.167.1189
SMILESOC(=O)c1ccnc(c1)C(O)=O