Reaction Details
TargetLysine-specific demethylase 4C
LigandBDBM50132132
Substrate/Competitorn/a
Meas. Tech.ChEMBL_835846 (CHEMBL2071957)
IC50>200000±n/a nM
Citation Leurs, UClausen, RPKristensen, JLLohse, B Inhibitor scaffold for the histone lysine demethylase KDM4C (JMJD2C). Bioorg Med Chem Lett22:5811-3 (2012) 
 
Lysine-specific demethylase 4C
Name:Lysine-specific demethylase 4C
Type:Protein
Mol. Mass.:119979.01
Organism:Homo sapiens (Human)
Description:Q9H3R0
Residue:1056
BDBM50132132
NameBDBM50132132
Synonyms:1H-pyrazole-3-carboxylic acid | CHEMBL128679
TypeSmall organic molecule
Emp. Form.C4H4N2O2
Mol. Mass.112.0868
SMILESOC(=O)c1ccn[nH]1