Reaction Details
TargetLysine-specific demethylase 4C
LigandBDBM50020856
Substrate/Competitorn/a
Meas. Tech.ChEMBL_835846 (CHEMBL2071957)
IC50>200000±n/a nM
Citation Leurs, UClausen, RPKristensen, JLLohse, B Inhibitor scaffold for the histone lysine demethylase KDM4C (JMJD2C). Bioorg Med Chem Lett22:5811-3 (2012) 
 
Lysine-specific demethylase 4C
Name:Lysine-specific demethylase 4C
Type:Protein
Mol. Mass.:119979.01
Organism:Homo sapiens (Human)
Description:Q9H3R0
Residue:1056
BDBM50020856
NameBDBM50020856
Synonyms:7-Nitro-5-phenyl-1,3-dihydro-benzo[e][1,4]diazepin-2-one CHEMBL13209 | NITRAZEPAM
TypeSmall organic molecule
Emp. Form.C15H11N3O3
Mol. Mass.281.2661
SMILES[O-][N+](=O)c1ccc2NC(=O)CN=C(c3ccccc3)c2c1