Reaction Details
TargetLysine-specific demethylase 4C
LigandBDBM50390945
Substrate/Competitorn/a
Meas. Tech.ChEMBL_835846 (CHEMBL2071957)
IC50>200000±n/a nM
Citation Leurs, UClausen, RPKristensen, JLLohse, B Inhibitor scaffold for the histone lysine demethylase KDM4C (JMJD2C). Bioorg Med Chem Lett22:5811-3 (2012) 
 
Lysine-specific demethylase 4C
Name:Lysine-specific demethylase 4C
Type:Protein
Mol. Mass.:119979.01
Organism:Homo sapiens (Human)
Description:Q9H3R0
Residue:1056
BDBM50390945
NameBDBM50390945
Synonyms:CHEMBL2071032
TypeSmall organic molecule
Emp. Form.C4H5N3O2
Mol. Mass.127.1014
SMILESCn1cc(nn1)C(O)=O