Reaction Details
TargetATP-binding cassette sub-family C member 2
LigandBDBM50390986
Substrate/Competitorn/a
Meas. Tech.ChEMBL_839289 (CHEMBL2077960)
Ki 85400±n/a nM
Citation Akhteruzzaman, SKato, YHisaka, ASugiyama, Y Primary active transport of peptidic endothelin antagonists by rat hepatic canalicular membrane. J Pharmacol Exp Ther288:575-81 (1999) ATP-binding cassette sub-family C member 2
Name:ATP-binding cassette sub-family C member 2
Type:PROTEIN
Mol. Mass.:173415.22
Organism:Rattus norvegicus
Description:ChEMBL_1455464
Residue:1541
BDBM50390986
NameBDBM50390986
Synonyms:CHEMBL2074710
TypeSmall organic molecule
Emp. Form.C39H58N8O9
Mol. Mass.782.926
SMILESCC(C)C[C@@H]1NC(=O)[C@H](NC(=O)[C@@H]2CCC(OC(=O)[C@H](CCCCN)N(C)C)N2C(=O)[C@@H](CC(O)=O)NC(=O)[C@@H](Cc2c[nH]c3ccccc23)NC1=O)C(C)C