Reaction Details
TargetSolute carrier organic anion transporter family member 2A1
LigandBDBM50390998
Substrate/Competitorn/a
Meas. Tech.ChEMBL_836140 (CHEMBL2077576)
Ki 162±n/a nM
Citation Itoh, SLu, RBao, YMorrow, JDRoberts, LJSchuster, VL Structural determinants of substrates for the prostaglandin transporter PGT. Mol Pharmacol50:738-42 (1996) Solute carrier organic anion transporter family member 2A1
Name:Solute carrier organic anion transporter family member 2A1
Type:Protein
Mol. Mass.:70404.97
Organism:Rattus norvegicus (Rat)
Description:Q00910
Residue:644
BDBM50390998
NameBDBM50390998
Synonyms:CHEMBL2075005
TypeSmall organic molecule
Emp. Form.C20H34O5
Mol. Mass.354.481
SMILESCCCCC[C@H](O)\C=C\[C@@H]1[C@@H](CCCCCCC(O)=O)[C@@H](O)CC1=O