Reaction Details
TargetSolute carrier family 22 member 6
LigandBDBM82898
Substrate/Competitorn/a
Meas. Tech.ChEMBL_835925 (CHEMBL2077063)
Ki 290000±n/a nM
Citation Jariyawat, SSekine, TTakeda, MApiwattanakul, NKanai, YSophasan, SEndou, H The interaction and transport of beta-lactam antibiotics with the cloned rat renal organic anion transporter 1. J Pharmacol Exp Ther290:672-7 (1999) Solute carrier family 22 member 6
Name:Solute carrier family 22 member 6
Type:PROTEIN
Mol. Mass.:60784.17
Organism:Rattus norvegicus
Description:ChEMBL_838479
Residue:551
BDBM82898
NameBDBM82898
Synonyms:(6R,7R)-3-(acetoxymethyl)-8-keto-7-[[2-(2-thienyl)acetyl]amino]-5-thia-1-azabicyclo[4.2.0]oct-2-ene-2-carboxylic acid (6R,7R)-3-(acetyloxymethyl)-8-oxo-7-[(1-oxo-2-thiophen-2-ylethyl)amino]-5-thia-1-azabicyclo[4.2.0]oct-2-ene-2-carboxylic acid Cephalothin SMR000386987 | cid_6024
TypeSmall organic molecule
Emp. Form.C16H16N2O6S2
Mol. Mass.396.438
SMILESCC(=O)OCC1=C(N2[C@H](SC1)[C@H](NC(=O)Cc1cccs1)C2=O)C(O)=O