Reaction Details
TargetSolute carrier family 15 member 2
LigandBDBM50169138
Substrate/Competitorn/a
Meas. Tech.ChEMBL_835961 (CHEMBL2077099)
Ki 23000±n/a nM
Citation Ramamoorthy, SLiu, WMa, YYYang-Feng, TLGanapathy, VLeibach, FH Proton/peptide cotransporter (PEPT 2) from human kidney: functional characterization and chromosomal localization. Biochim Biophys Acta1240:1-4 (1996) Solute carrier family 15 member 2
Name:Solute carrier family 15 member 2
Type:PROTEIN
Mol. Mass.:81795.62
Organism:Homo sapiens (Human)
Description:ChEMBL_762551
Residue:729
BDBM50169138
NameBDBM50169138
Synonyms:(S)-2-((S)-2,6-Diamino-hexanoylamino)-propionic acid | CHEMBL93178
TypeSmall organic molecule
Emp. Form.C9H19N3O3
Mol. Mass.217.2655
SMILESC[C@H](NC(=O)[C@@H](N)CCCCN)C(O)=O