Reaction Details
TargetATP-binding cassette sub-family C member 3
LigandBDBM18050
Substrate/Competitorn/a
Meas. Tech.ChEMBL_836618 (CHEMBL2077359)
Ki 90000±n/a nM
Citation Akita, HSuzuki, HHirohashi, TTakikawa, HSugiyama, Y Transport activity of human MRP3 expressed in Sf9 cells: comparative studies with rat MRP3. Pharm Res19:34-41 (2002) ATP-binding cassette sub-family C member 3
Name:ATP-binding cassette sub-family C member 3
Type:PROTEIN
Mol. Mass.:168984.11
Organism:Rattus norvegicus
Description:ChEMBL_839340
Residue:1522
BDBM18050
NameBDBM18050
Synonyms:2-[(4-{[(2,4-diaminopteridin-6-yl)methyl](methyl)amino}phenyl)formamido]pentanedioic acid MTX cid_126941
TypeSmall organic molecule
Emp. Form.C20H22N8O5
Mol. Mass.454.4393
SMILESCN(Cc1cnc2nc(N)nc(N)c2n1)c1ccc(cc1)C(=O)N[C@@H](CCC(O)=O)C(O)=O