Reaction Details
TargetABC-type glutathione-S-conjugate transporter
LigandBDBM50391004
Substrate/Competitorn/a
Meas. Tech.ChEMBL_836116 (CHEMBL2077552)
Ki 337000±n/a nM
Citation Akita, HSuzuki, HHirohashi, TTakikawa, HSugiyama, Y Transport activity of human MRP3 expressed in Sf9 cells: comparative studies with rat MRP3. Pharm Res19:34-41 (2002) ABC-type glutathione-S-conjugate transporter
Name:ABC-type glutathione-S-conjugate transporter
Type:PROTEIN
Mol. Mass.:167836.19
Organism:Homo sapiens (Human)
Description:ChEMBL_837732
Residue:1514
BDBM50391004
NameBDBM50391004
Synonyms:CHEMBL213947
TypeSmall organic molecule
Emp. Form.C16H19N5O10S
Mol. Mass.473.415
SMILESN[C@@H](CCC(=O)N[C@H](CSc1ccc(cc1[N+]([O-])=O)[N+]([O-])=O)C(=O)NCC(O)=O)C(O)=O