Reaction Details
TargetATP-binding cassette sub-family C member 2
LigandBDBM50391004
Substrate/Competitorn/a
Meas. Tech.ChEMBL_836158 (CHEMBL2075057)
Ki 25800±n/a nM
Citation Ishizuka, HKonno, KNaganuma, HSasahara, KKawahara, YNiinuma, KSuzuki, HSugiyama, Y Temocaprilat, a novel angiotensin-converting enzyme inhibitor, is excreted in bile via an ATP-dependent active transporter (cMOAT) that is deficient in Eisai hyperbilirubinemic mutant rats (EHBR). J Pharmacol Exp Ther280:1304-11 (1997) ATP-binding cassette sub-family C member 2
Name:ATP-binding cassette sub-family C member 2
Type:PROTEIN
Mol. Mass.:173415.22
Organism:Rattus norvegicus
Description:ChEMBL_1455464
Residue:1541
BDBM50391004
NameBDBM50391004
Synonyms:CHEMBL213947
TypeSmall organic molecule
Emp. Form.C16H19N5O10S
Mol. Mass.473.415
SMILESN[C@@H](CCC(=O)N[C@H](CSc1ccc(cc1[N+]([O-])=O)[N+]([O-])=O)C(=O)NCC(O)=O)C(O)=O