Reaction Details
TargetATP-binding cassette sub-family C member 2
LigandBDBM50391008
Substrate/Competitorn/a
Meas. Tech.ChEMBL_836949 (CHEMBL2075789)
Ki 9200±n/a nM
Citation Sasabe, HTsuji, ASugiyama, Y Carrier-mediated mechanism for the biliary excretion of the quinolone antibiotic grepafloxacin and its glucuronide in rats. J Pharmacol Exp Ther284:1033-9 (1998) ATP-binding cassette sub-family C member 2
Name:ATP-binding cassette sub-family C member 2
Type:PROTEIN
Mol. Mass.:173415.22
Organism:Rattus norvegicus
Description:ChEMBL_1455464
Residue:1541
BDBM50391008
NameBDBM50391008
Synonyms:CHEMBL2074711
TypeSmall organic molecule
Emp. Form.C25H30FN3O9
Mol. Mass.535.5188
SMILESCC1CN(CCN1)c1cc2n(cc(C(=O)O[C@@H]3O[C@@H]([C@@H](O)[C@H](O)[C@H]3O)C(O)=O)c(=O)c2c(C)c1F)C1CC1