Reaction Details
TargetPeroxisome proliferator-activated receptor alpha
LigandBDBM50099489
Substrate/Competitorn/a
Meas. Tech.ChEMBL_840441 (CHEMBL2089717)
IC50 1.9±n/a nM
Citation Solingapuram Sai, KKKil, KETu, ZChu, WFinck, BNRothfuss, JMShoghi, KIWelch, MJGropler, RJMach, RH Synthesis, radiolabeling and initial in vivo evaluation of [(11)C]KSM-01 for imaging PPAR-a receptors. Bioorg Med Chem Lett22:6233-6 (2012) 
 
Peroxisome proliferator-activated receptor alpha
Name:Peroxisome proliferator-activated receptor alpha
Type:Enzyme
Mol. Mass.:52222.08
Organism:Homo sapiens (Human)
Description:Q07869
Residue:468
BDBM50099489
NameBDBM50099489
Synonyms:2-(4-{2-[1-(4-Cyclohexyl-butyl)-3-(2-methoxy-phenyl)-ureido]-ethyl}-phenylsulfanyl)-2-methyl-propionic acid | CHEMBL20392
TypeSmall organic molecule
Emp. Form.C30H42N2O4S
Mol. Mass.526.73
SMILESCOc1ccccc1NC(=O)N(CCCCC1CCCCC1)CCc1ccc(SC(C)(C)C(O)=O)cc1