Reaction Details
Target5-hydroxytryptamine receptor 4
LigandBDBM50391068
Substrate/Competitorn/a
Meas. Tech.ChEMBL_841618 (CHEMBL2092044)
Ki 19.95±n/a nM
Citation Long, DDArmstrong, SRBeattie, DTChoi, SKFatheree, PRGendron, RAGenov, DGoldblum, AAHumphrey, PPJiang, LMarquess, DGShaw, JPSmith, JATurner, SDVickery, RG Discovery, oral pharmacokinetics and in vivo efficacy of velusetrag, a highly selective 5-HT(4) receptor agonist that has achieved proof-of-concept in patients with chronic idiopathic constipation. Bioorg Med Chem Lett22:6048-52 (2012) 
 
5-hydroxytryptamine receptor 4
Name:5-hydroxytryptamine receptor 4
Type:Enzyme
Mol. Mass.:43767.54
Organism:Homo sapiens (Human)
Description:Q13639
Residue:388
BDBM50391068
NameBDBM50391068
Synonyms:CHEMBL2087334
TypeSmall organic molecule
Emp. Form.C24H34N4O5S
Mol. Mass.490.616
SMILESCC(C)n1c2ccccc2cc(C(=O)N[C@@H]2C[C@@H]3CC[C@H](C2)N3CC(O)CNS(C)(=O)=O)c1=O