Reaction Details
TargetKallikrein-5 [D153N]
LigandBDBM50391079
Substrate/Competitorn/a
Meas. Tech.ChEMBL_840623 (CHEMBL2090274)
Ki 71900±n/a nM
Citation Freitas, RFTeixeira, TSBarros, TGSantos, JAKondo, MYJuliano, MAJuliano, LBlaber, MAntunes, OAAbrahão, OPinheiro, SMuri, EMPuzer, L Isomannide derivatives as new class of inhibitors for human kallikrein 7. Bioorg Med Chem Lett22:6072-5 (2012) 
 
Kallikrein-5 [D153N]
Name:Kallikrein-5 [D153N]
Type:PROTEIN
Mol. Mass.:32031.75
Organism:Homo sapiens (Human)
Description:ChEMBL_1282456
Residue:293
BDBM50391079
NameBDBM50391079
Synonyms:CHEMBL2087347
TypeSmall organic molecule
Emp. Form.C22H24N2O5S
Mol. Mass.428.501
SMILESCC(=O)N\C(=C/c1cccs1)C(=O)N[C@@H]1CO[C@@H]2[C@@H](CO[C@H]12)OCc1ccccc1