Reaction Details
TargetDual specificity tyrosine-phosphorylation-regulated kinase 1A
LigandBDBM50391186
Substrate/Competitorn/a
Meas. Tech.ChEMBL_840812 (CHEMBL2090595)
IC50>10000±n/a nM
Citation Bruel, ALogé, CTauzia, MLRavache, MLe Guevel, RGuillouzo, CLohier, JFOliveira Santos, JSLozach, OMeijer, LRuchaud, SBénédetti, HRobert, JM Synthesis and biological evaluation of new 5-benzylated 4-oxo-3,4-dihydro-5H-pyridazino[4,5-b]indoles as PI3Ka inhibitors. Eur J Med Chem57:225-33 (2012) 
 
Dual specificity tyrosine-phosphorylation-regulated kinase 1A
Name:Dual specificity tyrosine-phosphorylation-regulated kinase 1A
Type:Enzyme Catalytic Domain
Mol. Mass.:85573.59
Organism:RAT
Description:Dual-specificity tyrosine-(Y)-phosphorylation regulated kinase 1A 0 RAT::Q63470
Residue:763
BDBM50391186
NameBDBM50391186
Synonyms:CHEMBL2088664
TypeSmall organic molecule
Emp. Form.C19H16BrN3O2
Mol. Mass.398.253
SMILESCOc1ccc(Cn2c3ccc(Br)cc3c3c(C)n[nH]c(=O)c23)cc1