Reaction Details
TargetAcetylcholinesterase
LigandBDBM50391207
Substrate/Competitorn/a
Meas. Tech.ChEMBL_839486 (CHEMBL2090206)
IC50 9.4±n/a nM
Citation Samadi, AEstrada, MPérez, CRodríguez-Franco, MIIriepa, IMoraleda, IChioua, MMarco-Contelles, J Pyridonepezils, new dual AChE inhibitors as potential drugs for the treatment of Alzheimer's disease: synthesis, biological assessment, and molecular modeling. Eur J Med Chem57:296-301 (2012) 
 
Acetylcholinesterase
Name:Acetylcholinesterase
Type:Enzyme
Mol. Mass.:67792.70
Organism:Homo sapiens (Human)
Description:P22303
Residue:614
BDBM50391207
NameBDBM50391207
Synonyms:CHEMBL2088785
TypeSmall organic molecule
Emp. Form.C22H26N6
Mol. Mass.374.482
SMILESNc1nc(NCCCC2CCN(Cc3ccccc3)CC2)c(cc1C#N)C#N