Reaction Details
TargetDeoxyuridine 5'-triphosphate nucleotidohydrolase, mitochondrial
LigandBDBM50391350
Substrate/Competitorn/a
Meas. Tech.ChEMBL_847915 (CHEMBL2150114)
IC50 28±n/a nM
Citation Miyahara, SMiyakoshi, HYokogawa, TChong, KTTaguchi, JMuto, TEndoh, KYano, WWakasa, TUeno, HTakao, YFujioka, AHashimoto, AItou, KYamamura, KNomura, MNagasawa, HShuto, SFukuoka, M Discovery of highly potent human deoxyuridine triphosphatase inhibitors based on the conformation restriction strategy. J Med Chem55:5483-96 (2012) 
 
Deoxyuridine 5'-triphosphate nucleotidohydrolase, mitochondrial
Name:Deoxyuridine 5'-triphosphate nucleotidohydrolase, mitochondrial
Type:Enzyme
Mol. Mass.:26574.03
Organism:Homo sapiens (Human)
Description:P33316
Residue:252
BDBM50391350
NameBDBM50391350
Synonyms:CHEMBL2147979
TypeSmall organic molecule
Emp. Form.C22H29N3O5S
Mol. Mass.447.548
SMILESCC(C)(CC\C=C\Cn1ccc(=O)[nH]c1=O)NS(=O)(=O)c1cccc(OCC2CC2)c1