Reaction Details
TargetIndoleamine 2,3-dioxygenase 1
LigandBDBM17448
Substrate/Competitorn/a
Meas. Tech.ChEMBL_847930 (CHEMBL2150230)
IC50 180±n/a nM
Citation Röhrig, UFMajjigapu, SRGrosdidier, ABron, SStroobant, VPilotte, LColau, DVogel, PVan den Eynde, BJZoete, VMichielin, O Rational design of 4-aryl-1,2,3-triazoles for indoleamine 2,3-dioxygenase 1 inhibition. J Med Chem55:5270-90 (2012) 
 
Indoleamine 2,3-dioxygenase 1
Name:Indoleamine 2,3-dioxygenase 1
Type:PROTEIN
Mol. Mass.:45639.39
Organism:Mus musculus
Description:ChEMBL_1452149
Residue:407
BDBM17448
NameBDBM17448
Synonyms:1,2,3-triazole analogue, 4 | 5-phenyl-1H-1,2,3-triazole
TypeSmall organic molecule
Emp. Form.C8H7N3
Mol. Mass.145.1613
SMILESc1[nH]nnc1-c1ccccc1