Reaction Details
TargetIndoleamine 2,3-dioxygenase 1
LigandBDBM50391374
Substrate/Competitorn/a
Meas. Tech.ChEMBL_847930 (CHEMBL2150230)
IC50 60±n/a nM
Citation Röhrig, UFMajjigapu, SRGrosdidier, ABron, SStroobant, VPilotte, LColau, DVogel, PVan den Eynde, BJZoete, VMichielin, O Rational design of 4-aryl-1,2,3-triazoles for indoleamine 2,3-dioxygenase 1 inhibition. J Med Chem55:5270-90 (2012) 
 
Indoleamine 2,3-dioxygenase 1
Name:Indoleamine 2,3-dioxygenase 1
Type:PROTEIN
Mol. Mass.:45639.39
Organism:Mus musculus
Description:ChEMBL_1452149
Residue:407
BDBM50391374
NameBDBM50391374
Synonyms:CHEMBL2146496
TypeSmall organic molecule
Emp. Form.C7H5ClN4
Mol. Mass.180.594
SMILESClc1cc(ccn1)-c1c[nH]nn1