Reaction Details
TargetCarbonic anhydrase 12
LigandBDBM50387131
Substrate/Competitorn/a
Meas. Tech.ChEMBL_847943 (CHEMBL2150243)
Ki 2±n/a nM
Citation Gieling, RGBabur, MMamnani, LBurrows, NTelfer, BACarta, FWinum, JYScozzafava, ASupuran, CTWilliams, KJ Antimetastatic effect of sulfamate carbonic anhydrase IX inhibitors in breast carcinoma xenografts. J Med Chem55:5591-600 (2012) 
 
Carbonic anhydrase 12
Name:Carbonic anhydrase 12
Type:Enzyme
Mol. Mass.:39456.00
Organism:Homo sapiens (Human)
Description:Catalytic domain of human cloned isozyme was used in the assay
Residue:354
BDBM50387131
NameBDBM50387131
Synonyms:4-ureidophenyl sulfamate ring derivative 3p | CHEMBL2047811
TypeSmall organic molecule
Emp. Form.C15H17N3O4S
Mol. Mass.335.378
SMILESCc1cc(C)cc(NC(=O)Nc2ccc(OS(N)(=O)=O)cc2)c1