Reaction Details
TargetCarbonic anhydrase 1
LigandBDBM50387124
Substrate/Competitorn/a
Meas. Tech.ChEMBL_847940 (CHEMBL2150240)
Ki 4360±n/a nM
Citation Gieling, RGBabur, MMamnani, LBurrows, NTelfer, BACarta, FWinum, JYScozzafava, ASupuran, CTWilliams, KJ Antimetastatic effect of sulfamate carbonic anhydrase IX inhibitors in breast carcinoma xenografts. J Med Chem55:5591-600 (2012) 
 
Carbonic anhydrase 1
Name:Carbonic anhydrase 1
Type:Enzyme
Mol. Mass.:28873.37
Organism:Homo sapiens (Human)
Description:P00915
Residue:261
BDBM50387124
NameBDBM50387124
Synonyms:4-ureidophenyl sulfamate ring derivative 3i | CHEMBL2047804
TypeSmall organic molecule
Emp. Form.C19H17N3O5S
Mol. Mass.399.42
SMILESNS(=O)(=O)Oc1ccc(NC(=O)Nc2ccc(Oc3ccccc3)cc2)cc1