Reaction Details
TargetCarbonic anhydrase 1
LigandBDBM50387115
Substrate/Competitorn/a
Meas. Tech.ChEMBL_847940 (CHEMBL2150240)
Ki 2800±n/a nM
Citation Gieling, RGBabur, MMamnani, LBurrows, NTelfer, BACarta, FWinum, JYScozzafava, ASupuran, CTWilliams, KJ Antimetastatic effect of sulfamate carbonic anhydrase IX inhibitors in breast carcinoma xenografts. J Med Chem55:5591-600 (2012) 
 
Carbonic anhydrase 1
Name:Carbonic anhydrase 1
Type:Enzyme
Mol. Mass.:28873.37
Organism:Homo sapiens (Human)
Description:P00915
Residue:261
BDBM50387115
NameBDBM50387115
Synonyms:CHEMBL2047797
TypeSmall organic molecule
Emp. Form.C13H12FN3O4S
Mol. Mass.325.315
SMILESNS(=O)(=O)Oc1ccc(NC(=O)Nc2ccc(F)cc2)cc1