Reaction Details
TargetCarbonic anhydrase 12
LigandBDBM50387115
Substrate/Competitorn/a
Meas. Tech.ChEMBL_847943 (CHEMBL2150243)
Ki 9±n/a nM
Citation Gieling, RGBabur, MMamnani, LBurrows, NTelfer, BACarta, FWinum, JYScozzafava, ASupuran, CTWilliams, KJ Antimetastatic effect of sulfamate carbonic anhydrase IX inhibitors in breast carcinoma xenografts. J Med Chem55:5591-600 (2012) 
 
Carbonic anhydrase 12
Name:Carbonic anhydrase 12
Type:Enzyme
Mol. Mass.:39456.00
Organism:Homo sapiens (Human)
Description:Catalytic domain of human cloned isozyme was used in the assay
Residue:354
BDBM50387115
NameBDBM50387115
Synonyms:CHEMBL2047797
TypeSmall organic molecule
Emp. Form.C13H12FN3O4S
Mol. Mass.325.315
SMILESNS(=O)(=O)Oc1ccc(NC(=O)Nc2ccc(F)cc2)cc1