Reaction Details
TargetCarbonic anhydrase 9
LigandBDBM50387128
Substrate/Competitorn/a
Meas. Tech.ChEMBL_847942 (CHEMBL2150242)
Ki 6±n/a nM
Citation Gieling, RGBabur, MMamnani, LBurrows, NTelfer, BACarta, FWinum, JYScozzafava, ASupuran, CTWilliams, KJ Antimetastatic effect of sulfamate carbonic anhydrase IX inhibitors in breast carcinoma xenografts. J Med Chem55:5591-600 (2012) 
 
Carbonic anhydrase 9
Name:Carbonic anhydrase 9
Type:Enzyme
Mol. Mass.:49669.03
Organism:Homo sapiens (Human)
Description:Catalytic domain of human cloned isozyme was used in the assay
Residue:459
BDBM50387128
NameBDBM50387128
Synonyms:4-ureidophenyl sulfamate ring derivative 3m | CHEMBL2047808
TypeSmall organic molecule
Emp. Form.C13H12N4O6S
Mol. Mass.352.323
SMILESNS(=O)(=O)Oc1ccc(NC(=O)Nc2ccc(cc2)[N+]([O-])=O)cc1