Reaction Details
TargetCarbonic anhydrase 1
LigandBDBM50387127
Substrate/Competitorn/a
Meas. Tech.ChEMBL_847940 (CHEMBL2150240)
Ki 5460±n/a nM
Citation Gieling, RGBabur, MMamnani, LBurrows, NTelfer, BACarta, FWinum, JYScozzafava, ASupuran, CTWilliams, KJ Antimetastatic effect of sulfamate carbonic anhydrase IX inhibitors in breast carcinoma xenografts. J Med Chem55:5591-600 (2012) 
 
Carbonic anhydrase 1
Name:Carbonic anhydrase 1
Type:Enzyme
Mol. Mass.:28873.37
Organism:Homo sapiens (Human)
Description:P00915
Residue:261
BDBM50387127
NameBDBM50387127
Synonyms:4-ureidophenyl sulfamate ring derivative 3l | CHEMBL2047807
TypeSmall organic molecule
Emp. Form.C15H17N3O4S
Mol. Mass.335.378
SMILESNS(=O)(=O)Oc1ccc(NC(=O)NCCc2ccccc2)cc1