Reaction Details
TargetCarbonic anhydrase 1
LigandBDBM50387129
Substrate/Competitorn/a
Meas. Tech.ChEMBL_847940 (CHEMBL2150240)
Ki 4370±n/a nM
Citation Gieling, RGBabur, MMamnani, LBurrows, NTelfer, BACarta, FWinum, JYScozzafava, ASupuran, CTWilliams, KJ Antimetastatic effect of sulfamate carbonic anhydrase IX inhibitors in breast carcinoma xenografts. J Med Chem55:5591-600 (2012) 
 
Carbonic anhydrase 1
Name:Carbonic anhydrase 1
Type:Enzyme
Mol. Mass.:28873.37
Organism:Homo sapiens (Human)
Description:P00915
Residue:261
BDBM50387129
NameBDBM50387129
Synonyms:4-ureidophenyl sulfamate ring derivative 3n | CHEMBL2047809
TypeSmall organic molecule
Emp. Form.C15H18N4O4S
Mol. Mass.350.393
SMILESCN(C)c1ccc(NC(=O)Nc2ccc(OS(N)(=O)=O)cc2)cc1