Reaction Details
TargetCarbonic anhydrase 2
LigandBDBM50387117
Substrate/Competitorn/a
Meas. Tech.ChEMBL_847941 (CHEMBL2150241)
Ki 413±n/a nM
Citation Gieling, RGBabur, MMamnani, LBurrows, NTelfer, BACarta, FWinum, JYScozzafava, ASupuran, CTWilliams, KJ Antimetastatic effect of sulfamate carbonic anhydrase IX inhibitors in breast carcinoma xenografts. J Med Chem55:5591-600 (2012) 
 
Carbonic anhydrase 2
Name:Carbonic anhydrase 2
Type:Enzyme
Mol. Mass.:29250.71
Organism:Homo sapiens (Human)
Description:P00918
Residue:260
BDBM50387117
NameBDBM50387117
Synonyms:4-ureidophenyl sulfamate ring derivative 3g | CHEMBL2047802
TypeSmall organic molecule
Emp. Form.C14H15N3O5S
Mol. Mass.337.351
SMILESCOc1ccc(NC(=O)Nc2ccc(OS(N)(=O)=O)cc2)cc1