Reaction Details
TargetCarbonic anhydrase 2
LigandBDBM50387127
Substrate/Competitorn/a
Meas. Tech.ChEMBL_847941 (CHEMBL2150241)
Ki 213±n/a nM
Citation Gieling, RGBabur, MMamnani, LBurrows, NTelfer, BACarta, FWinum, JYScozzafava, ASupuran, CTWilliams, KJ Antimetastatic effect of sulfamate carbonic anhydrase IX inhibitors in breast carcinoma xenografts. J Med Chem55:5591-600 (2012) 
 
Carbonic anhydrase 2
Name:Carbonic anhydrase 2
Type:Enzyme
Mol. Mass.:29250.71
Organism:Homo sapiens (Human)
Description:P00918
Residue:260
BDBM50387127
NameBDBM50387127
Synonyms:4-ureidophenyl sulfamate ring derivative 3l | CHEMBL2047807
TypeSmall organic molecule
Emp. Form.C15H17N3O4S
Mol. Mass.335.378
SMILESNS(=O)(=O)Oc1ccc(NC(=O)NCCc2ccccc2)cc1