Reaction Details
TargetCarbonic anhydrase 2
LigandBDBM50387128
Substrate/Competitorn/a
Meas. Tech.ChEMBL_847941 (CHEMBL2150241)
Ki 450±n/a nM
Citation Gieling, RGBabur, MMamnani, LBurrows, NTelfer, BACarta, FWinum, JYScozzafava, ASupuran, CTWilliams, KJ Antimetastatic effect of sulfamate carbonic anhydrase IX inhibitors in breast carcinoma xenografts. J Med Chem55:5591-600 (2012) 
 
Carbonic anhydrase 2
Name:Carbonic anhydrase 2
Type:Enzyme
Mol. Mass.:29250.71
Organism:Homo sapiens (Human)
Description:P00918
Residue:260
BDBM50387128
NameBDBM50387128
Synonyms:4-ureidophenyl sulfamate ring derivative 3m | CHEMBL2047808
TypeSmall organic molecule
Emp. Form.C13H12N4O6S
Mol. Mass.352.323
SMILESNS(=O)(=O)Oc1ccc(NC(=O)Nc2ccc(cc2)[N+]([O-])=O)cc1