Reaction Details
TargetProtein kinase C alpha type
LigandBDBM50391387
Substrate/Competitorn/a
Meas. Tech.ChEMBL_848573 (CHEMBL2148237)
Ki 15±n/a nM
Citation Kikumori, MYanagita, RCTokuda, HSuzuki, NNagai, HSuenaga, KIrie, K Structure-activity studies on the spiroketal moiety of a simplified analogue of debromoaplysiatoxin with antiproliferative activity. J Med Chem55:5614-26 (2012) 
 
Protein kinase C alpha type
Name:Protein kinase C alpha type
Type:Enzyme
Mol. Mass.:76755.65
Organism:Homo sapiens (Human)
Description:The recombinant human PKC enzymes were produced using a baculovirus expression system in SF9 cells
Residue:672
BDBM50391387
NameBDBM50391387
Synonyms:CHEMBL2148107
TypeSmall organic molecule
Emp. Form.C28H40O8
Mol. Mass.504.6124
SMILESC[C@@H]1CC(C)(C)[C@@]23C[C@@H](C[C@@H](CCCCc4cccc(O)c4)O2)OC(=O)C[C@H](CO)OC(=O)C[C@@H]1O3